{"text_format":"1","workbook":"xlsx","n_sheets":16,"sheets":["Introduction","Table of Contents","Operations in Inventory","Direct - Fuel Combust.","Mobile & Transportation","Waste Mngmt.","CHP Allocation","Indirect - Energy Imports","Indirect - Energy Exports","Summary Table","Custom Emission Factors","Energy content","Conversion Factors","Biomass Combustion CO2","GWPs","Revisions"],"not_rendered":{"charts":0,"images":1,"macros":0,"external_links":3,"defined_names":126,"comments":1,"pivot_tables":0},"unopened":[],"bounds":{"document_bytes":16777216,"sheet_cells":100000,"rows_first":2000,"rows_last":500,"rows_between":2000,"halvings":0,"cell_chars":16384,"cell_head_chars":4096},"cells_cut":0,"cells_raw":0,"read":"whole","date_system":"1900"}

{"sheet":"Introduction","index":0,"n_rows":29,"n_cols":8,"rows_kept":29,"cut":false,"hidden":false,"merged":[[24,2,24,7],[26,3,26,8],[27,3,27,8],[28,3,28,8],[0,1,0,10],[1,2,1,8],[3,2,5,10],[6,2,6,7],[7,2,8,7],[22,2,22,7]]}
[null,"NCASI Spreadsheet for Calculating GHG Emissions from \nWood Products Manufacturing Facilities\n\nEnglish Units\n\nWorkbook Version 1.1 (see below for USER AGREEMENT)"]
[null,null,"An aid to developing estimates using the methods in \"Calculation tools for estimating greenhouse gas emissions from wood products manufacturing facilities,\" Report Version 1.0"]
[]
[null,null,"This tool intends to facilitate the calculation of direct CO2, CH4, and N2O emissions from wood products manufacturing facilities and ancillary operations.  It also addresses emissions attributable to the purchase and export of electricity and/or steam. \n\n"]
[]
[]
[]
[null,null,"The example reporting format provided in the \"Calculation tools for estimating greehouse gas emissions from wood products manufacturing facilities\" can be achieved by printing the following completed worksheets:"]
[]
[null,null,null,"Operations in Inventory"]
[null,null,null,"Direct - Fuel Combust.",null,null,"EXPLANATION OF CELL COLOR SCHEME"]
[null,null,null,"Direct - Mobile & Transportation"]
[null,null,null,"Direct - Waste Mngmt.",null,null,null,"User entry"]
[null,null,null,"CHP allocation",null,null,null,"Calculated value"]
[null,null,null,"Indirect - Energy Imports"]
{"$rows_left_out":15}
{"sheet":"Table of Contents","index":1,"n_rows":18,"n_cols":4,"rows_kept":18,"cut":false,"hidden":false,"merged":[[19,3,19,8],[20,3,20,8],[21,3,21,8],[22,3,22,8],[6,3,6,7],[9,3,9,7],[10,3,10,7],[11,3,11,7],[13,3,13,6],[14,3,14,5]]}
[null,"TABLE OF CONTENTS"]
[null,null,"Name of worksheet","Content / purpose"]
[]
[null,null,"Introduction"]
[null,null,"Table of Contents"]
[null,null,"Operations in Inventory","Describing the inventory boundaries and listing the operations included in the inventory"]
[null,null,"Direct - Fuel Combust.","Direct emissions of CO2, CH4, and N2O resulting from fuel combustion in stationary devices - includes emission factors from IPCC"]
[null,null,"Mobile & Transportation","Emissions of CO2, CH4, and N2O from fuel combustion in mobile equipment and transportation devices"]
[null,null,"Waste Mngmt.","Emissions of CH4 resulting from mill-owned landfills or anaerobic treatment operations"]
[null,null,"CHP Allocation","Allocation emissions from combined heat and power systems"]
[null,null,"Indirect - Energy Imports","GHG emissions resulting from electricity and /or steam imports"]
[null,null,"Indirect - Energy Exports","GHG emission impacts associated with electricity and /or steam exports"]
[null,null,"Summary Table","Summarizes results of inventory"]
[null,null,"Custom Emission Factors","Calculating custom emission factors"]
[null,null,"Energy Content","Fuel specific higher heating values"]
{"$rows_left_out":4}
{"sheet":"Operations in Inventory","index":2,"n_rows":44,"n_cols":7,"rows_kept":44,"cut":false,"hidden":false,"merged":[[14,5,14,6],[15,5,15,6],[17,5,17,6],[1,1,1,7],[4,1,4,5],[7,5,7,6],[8,5,8,6],[9,5,9,6],[12,5,12,6]]}
[null,"OPERATIONS IN INVENTORY"]
[null,"This worksheet is for showing which operations are included in the inventory"]
[null,null,null,null,null,"User enters information in spaces with this color  "]
[]
[null,"Operations in the Inventory"]
[]
[null,null,null,null,null,"Identifying name assigned to this inventory:"]
[]
[null,null,null,null,null,"Use this space to provide a general description of operational boundaries."]
[]
[]
[null,null,null,null,null,"Use this space to provide additional information helpful to understanding the operational boundaries of the inventory. "]
[]
[]
[null,null,null,null,null,"Use this space to provide additional information helpful to understanding how emissions from partial ownership situations are allocated. "]
{"$rows_left_out":30}
{"sheet":"Direct - Fuel Combust.","index":3,"n_rows":77,"n_cols":13,"rows_kept":77,"cut":false,"hidden":false,"merged":[[76,3,76,6],[74,3,74,6],[38,3,39,6],[41,2,41,7],[46,2,46,7],[54,2,54,7],[68,2,68,7],[3,2,3,6],[6,1,6,2],[7,1,7,2],[33,6,33,7],[11,8,11,11],[11,5,11,7],[15,5,15,7]]}
[]
[]
[null,null,"Direct Emissions - Stationary Fuel Combustion, (including methane and nitrous oxide emissions from biomass fuels)"]
[null,null,"Note: Emissions from mobile sources are reported on the \"Direct - Mobile & Transportation\" spreadsheet immediately behind this spreadsheet"]
[]
[null,"EXPLANATION OF CELL COLOR SCHEME"]
[null,"User entry"]
[null,"Calculated value"]
[]
[]
[null,"Direct Emissions - Stationary Fuel Combustion"]
[null,null,null,null,"Step 1","Step 2",null,null,"Step 3"]
[null,null,null,null,"A","B","C ","D","E","F","G","H"]
[null,null,null,null,"Quantity of fuel burned","CO2 emission factor\n[Emission factors from IPCC are shown below]","CH4 emission factor\n[Emission factors from IPCC are shown below]","N2O emission factor\n[Emission factors from IPCC are shown below]","CO2 emissions in metric tonnes","CH4 emissions in metric tonnes","N2O emissions in metric tonnes","Total emissions in terms of CO2 equivalents\n(metric tonnes)"]
[null,null,null,null,"(MMBtu HHV)","(lb CO2/MMBtu HHV)","(lb CH4/MMBtu HHV)","(lb N2O/MMBtu HHV)"]
{"$rows_left_out":63}
{"sheet":"Mobile & Transportation","index":4,"n_rows":110,"n_cols":29,"rows_kept":110,"cut":false,"hidden":false,"merged":[[17,6,17,7],[22,22,23,27],[95,24,98,28],[7,1,7,2],[4,2,4,11],[16,4,19,4],[8,1,8,2],[106,8,106,10],[106,11,106,13],[47,22,49,25],[78,4,78,5],[101,6,101,8],[94,25,94,27],[99,24,101,28],[82,6,82,8],[78,12,78,14],[78,9,78,11],[90,23,90,28],[78,6,78,8],[99,9,99,11],[99,12,99,14]]}
[null,null,"Direct or Indirect - Mobile and Transportation Source Emissions"]
[null,null,"Note: Emissions from stationary sources are reported on the \"Direct-Fuel Combust.\" spreadsheet immediately in front of this spreadsheet"]
[]
[]
[null,null,"This worksheet can be used to calculate emissions from mobile combustion sources, including transportation.\nThe worksheet contains two parts:\n    Part 1 is used to calculate transportation emissions based on quantity of fuels consumed.\n    Part 2 is used to calculate emissions from non-transportation mobile sources such as harvesting equipment.\n\nAvoid double counting!  If transportation emissions for a fleet are estimated using Part 1, do not also estimate emissions for this same fleet using Part 2.\n\nDo not include any combustion sources on this page that were already addressed in the \"Direct - Fuel Combust.\" sheet."]
[]
[null,"EXPLANATION OF CELL COLOR SCHEME"]
[null,"User entry"]
[null,"Calculated value"]
[]
[]
[]
[]
[null,"Part 1.  Transportation Emissions Calculated from Fuel Used:  All Modes of Transport ",null,null,null,null,null,null,null,null,null,null,null,null,null,{"$f":"IF(AND(Q17>0,Q19>0),\"Enter mpg OR l/100km, not both!\",\"\")","v":""}]
[null,"Note:  Use this worksheet to calculate emissions from amount of fuel consumed. ",null,null,null,null,null,null,null,null,null,null,null,null,null,null,"Optional Calculator"]
{"$rows_left_out":96}
{"sheet":"Waste Mngmt.","index":5,"n_rows":157,"n_cols":57,"rows_kept":157,"cut":false,"hidden":false,"merged":[[12,2,12,6],[48,2,48,11],[43,10,43,13],[122,2,122,5],[7,1,7,2],[8,1,8,2],[13,2,13,8],[15,4,15,13],[31,4,31,10],[152,4,152,9],[156,3,156,8],[27,8,27,11],[115,9,115,12],[45,10,45,13],[31,11,31,14],[29,2,29,11],[140,4,140,11],[138,2,138,5],[137,5,137,10],[54,2,54,4],[55,2,55,4],[125,4,125,12]]}
[null,null,"Direct or Indirect Emissions - Waste Management"]
[null,null,"For landfills and anaerobic wastewater treatment and sludge digestion systems"]
[null,null,"Note: Scroll down the page to find the spreadsheet for anaerobic treatment systems"]
[]
[]
[]
[null,"EXPLANATION OF CELL COLOR SCHEME"]
[null,"User entry"]
[null,"Calculated value"]
[]
[]
[null,null,"Note: On this sheet, Standard conditions refers to 0°C and 1 atm pressure"]
[null,null,"Methane emissions from landfills\nNote: Use only one of the following methods for each landfill."]
[null,null,"Method 1 - For landfills with low permeability caps and effective gas recovery systems \nwhere measurements are made of amounts of gas collected\nIT IS IMPORTANT TO NOT ESTIMATE EMISSIONS FOR A SINGLE LANDFILL BY MORE THAN ONE METHOD TO AVOID DOUBLE COUNTING!"]
[]
{"$rows_left_out":143}
{"sheet":"CHP Allocation","index":6,"n_rows":31,"n_cols":17,"rows_kept":31,"cut":false,"hidden":false,"merged":[[2,3,2,11],[11,2,11,10],[13,3,13,11],[17,8,17,9],[30,1,30,9]]}
[]
[]
[null,null,null,"Combined heat and power:  \nAllocating emissions based on the efficiency of heat and power production"]
[]
[null,null,null,"Note:  If a facility is using all of the energy outputs of a CHP system, there is no need to allocate the emissions."]
[]
[null,null,null,"EXPLANATION OF CELL COLOR SCHEME"]
[null,null,null,null,"User entry"]
[null,null,null,null,"Calculated value"]
[]
[]
[null,null,"Combined heat and power:  \nAllocating emissions based on the efficiency of heat and power production"]
[]
[null,null,null,"Simplified Efficiency Method: \nAllocation based on assumed efficiencies for both steam and power production and total CHP emissions"]
[]
{"$rows_left_out":17}
{"sheet":"Indirect - Energy Imports","index":7,"n_rows":36,"n_cols":11,"rows_kept":36,"cut":false,"hidden":false,"merged":[[28,5,28,6],[30,2,30,9],[10,4,10,6],[10,7,10,9]]}
[null,null,"Indirect Emissions"]
[null,null,"Electricity and/or steam imports"]
[]
[null,"EXPLANATION OF CELL COLOR SCHEME"]
[null,null,null,"User entry"]
[null,null,null,"Calculated value"]
[]
[]
[null,null,"Indirect Emissions from electricity and steam imports"]
[]
[null,null,null,"Step 1","Step 2",null,null,"Step 3",null,null,"Step 4"]
[null,null,null,"A","B","C","D","E","F","G","H"]
[null,null,null,"Electricity and/or steam Import","CO2 emission factor for imported electricity or steam*","CH4 emission factor for imported electricity or steam*","N2O emission factor for imported electricity or steam*","Indirect CO2 emissions in metric tonnes","Indirect CH4 emissions in metric tonnes","Indirect N2O emissions in metric tonnes","Explain source or basis of emission factors for estimating emissions from imported electricity or steam"]
[null,null,null,null,null,null,null,"E = A * B / 2205","F = A * C / 2205","G = A * D / 2205"]
[null,null,null,"MWh","lb CO2 / MWh","lb CH4 / MWh","lb N2O / MWh"," metric tons CO2"," metric tons CH4"," metric tons N2O","Text explanation"]
{"$rows_left_out":22}
{"sheet":"Indirect - Energy Exports","index":8,"n_rows":33,"n_cols":14,"rows_kept":33,"cut":false,"hidden":false,"merged":[[32,4,32,7],[10,2,10,7],[15,4,15,6],[15,8,15,10]]}
[null,null,"Emissions Associated with Exports of Electricity and Steam"]
[]
[null,null,"Note: The emissions and indirect emissions impacts related to electricity and steam exports "]
[null,null,"should be reported separately from indirect emissions from imported power or steam"]
[]
[]
[null,null,"User entry"]
[null,null,"Calculated value"]
[]
[]
[null,null,"Indirect emission impacts related to electricity and steam exports"]
[]
[]
[null,null,"The indirect emissions impact is based on amount of emissions associated with producing the exported power or steam"]
[]
{"$rows_left_out":19}
{"sheet":"Summary Table","index":9,"n_rows":31,"n_cols":9,"rows_kept":31,"cut":false,"hidden":false,"merged":[[30,2,30,4],[3,5,3,8],[5,5,5,8],[3,2,3,4],[12,2,12,3],[29,2,29,3],[18,2,18,3],[21,2,21,4],[23,2,23,4],[25,2,25,4],[10,3,10,4],[14,2,14,4],[16,2,16,4],[5,2,5,4],[19,2,19,4],[8,2,8,3]]}
[null,null,"Summary of Inventory Results"]
[]
[null,null,"Summary of Inventory Results"]
[null,null,"Name of Inventory",null,null,{"$f":"IF('Operations in Inventory'!F8=\"\",\"\",'Operations in Inventory'!F8)","v":""}]
[]
[null,null,"General description of inventory boundaries",null,null,{"$f":"IF('Operations in Inventory'!F10=\"\",\"\",'Operations in Inventory'!F10)","v":""}]
[]
[null,null,"Direct Emission Impacts",null,null,"CO2\n(metric tonnes)","CH4\n(metric tonnes)","N2O\n(metric tonnes)","CO2-equiv\n(metric tonnes)"]
[null,null,"Direct emissions from stationary fuel combustion",null,null,{"$f":"'Direct - Fuel Combust.'!I34","v":0},{"$f":"'Direct - Fuel Combust.'!J34","v":0},{"$f":"'Direct - Fuel Combust.'!K34","v":0},{"$f":"F9+G9*GWP_CH4+H9*GWP_N2O","v":0}]
[]
[null,null,null,"Direct emissions attributable to exports of steam and power (a subset of direct emissions from stationary combustion)",null,{"$f":"'Indirect - Energy Exports'!I33","v":0},{"$f":"'Indirect - Energy Exports'!J33","v":0},{"$f":"'Indirect - Energy Exports'!K33","v":0},{"$f":"F11+G11*GWP_CH4+H11*GWP_N2O","v":0}]
[]
[null,null,"Direct emissions from transportation and mobile sources",null,null,{"$f":"'Mobile & Transportation'!I109","v":0},{"$f":"'Mobile & Transportation'!J109","v":0},{"$f":"'Mobile & Transportation'!K109","v":0},{"$f":"F13+G13*GWP_CH4+H13*GWP_N2O","v":0}]
[]
[null,null,"Direct emissions from waste management",null,null,"N/A",{"$f":"'Waste Mngmt.'!Q46+'Waste Mngmt.'!J157","v":0},"N/A",{"$f":"G15*GWP_CH4","v":0}]
{"$rows_left_out":17}
{"sheet":"Custom Emission Factors","index":10,"n_rows":22,"n_cols":6,"rows_kept":22,"cut":false,"hidden":false,"merged":[]}
[]
[null,null,"Custom Emission Factors"]
[null,null,"Calculating custom emission factors"]
[]
[null,"EXPLANATION OF CELL COLOR SCHEME"]
[null,null,null,"User entry"]
[null,null,null,"Calculated value"]
[]
[]
[]
[null,null,null,"A","B","C"]
[null,null,null,"Fuel Higher Heating Value (HHV)","Carbon Content","Emission Factor"]
[null,null,null,null,null,"C = 2000 * B * 3.664 / A"]
[null,null,null,"MMBtu HHV / short ton","(% w/w)","lb CO2 / MMBtu HHV"]
[null,null,null,null,"This should be entered as a fraction, i.e. 0 > x > 1 "]
{"$rows_left_out":8}
{"sheet":"Energy content","index":11,"n_rows":35,"n_cols":5,"rows_kept":35,"cut":false,"hidden":false,"merged":[[2,0,2,5],[31,1,31,4],[33,1,33,4],[34,1,34,4],[32,1,32,4]]}
[]
["Energy content (HHV)"]
["Fuel specific higher heating values"]
["Based on information in WRI/WBCSD Calculation tools"]
[]
[]
[]
[null,"Fuel type","Higher heating value","Carbon, % by weight","Typical density"]
[null,null,"(MMBtu HHV/bbl - 42 gal) if not otherwise mentioned",null,"( lb/gal ) if not otherwise mentioned"]
[]
[null,"Gasoline / petrol",5.46,85.5,6.17]
[null,"Kerosene",5.67,86.01,6.76]
[null,"Distillate fuel oil No.1",5.88,86.6,7.05]
[null,"Distillate fuel oil No.2",5.88,87.3,7.05]
[null,"Residual fuel oil No.4",6.01,86.4,7.59]
{"$rows_left_out":21}
{"sheet":"Conversion Factors","index":12,"n_rows":37,"n_cols":6,"rows_kept":37,"cut":false,"hidden":false,"merged":[]}
[]
["Conversion Factors"]
["Based on information in WRI/WBCSD Calculation tools"]
[]
[]
[null,null,"Mass"]
[null,null,"1 pound (lb)","453.6 grams (g)","0.4536 kilograms (kg)","0.0004536 metric tonnes"]
[null,null,"1 kilogram (kg)","2.205 pounds (lb)"]
[null,null,"1 short ton (ton)","2,000 pounds (lb)","907.2 kilograms (kg)"]
[null,null,"1 metric tonne","2,205 pounds (lb)","1,000 kilograms (kg)","1.1023 short tons (tons)"]
[]
[null,null,"Volume"]
[null,null,"1 cubic foot (ft 3)","7.4805 gallons (gal)","0.1781 barrel (bbl)"]
[null,null,"1 cubic foot (ft 3)","28.32 liters (L)","0.02832 cubic meters (m 3)"]
[null,null,"1 gallon (US liquid - gal)","0.0238 barrel (bbl)","3.785 liters (L)","0.003785 cubic meters (m 3)"]
{"$rows_left_out":23}
{"sheet":"Biomass Combustion CO2","index":13,"n_rows":36,"n_cols":11,"rows_kept":36,"cut":false,"hidden":false,"merged":[[0,1,0,12],[4,1,4,6],[6,1,6,6],[8,1,8,6],[34,3,34,12],[12,1,12,2],[13,1,13,2],[32,6,32,8],[18,8,18,9],[18,4,18,5],[18,6,18,7]]}
[]
[]
[null,null,"Additional Information on Biomass"]
[null,null,"Estimating CO2 Emissions from Biomass Combustion."]
[null,"Many wood products manufacturing facilities generate more than half of their energy needs from biomass fuels recovered from the industry’s waste and process streams.  The CO2 generated when biomass fuels are burned is not included in GHG emissions totals.  The GHG Protocol, however, requires that biomass-derived CO2 be reported as additional information.  This is the approach generally prescribed for national inventories by the United Nations Framework Convention on Climate Change."]
[]
[null,"Any increases or decreases in the amount of carbon sequestered by the forests are accounted for in the comprehensive forest accounting system.  This is the approach generally prescribed for national inventories by the United Nations Framework Convention on Climate Change.  Most international protocols including that of the Intergovernmental Panel on Climate Change (IPCC) have adopted the convention set out by the United Nations."]
[]
[null,"Estimated Biomass Emissions:\nThe information reported below on biomass emissions is being supplied:\n\n To ensure that readers understand the entity’s overall energy profile in terms of both greenhouse gas emissions, and non-greenhouse gas emissions, and\n To provide awareness and understanding of how biomass fuels are generated and used in the manufacture of wood products.\n\nAlso, note that the information reported below is in conformance with the general greenhouse gas protocol designed by the World Resources Institute and the World Business Council for Sustainable Development.  Users of these calculation tools may elect to modify the format and type of information presented based on specific facility or company needs.\n"]
[]
[]
[null,"EXPLANATION OF CELL COLOR SCHEME"]
[null,"User entry "]
[null,"Calculated value"]
[]
{"$rows_left_out":22}
{"sheet":"GWPs","index":14,"n_rows":15,"n_cols":17,"rows_kept":15,"cut":false,"hidden":false,"merged":[[1,2,1,6],[1,7,1,11],[1,12,1,16]]}
["Global Warming Potentials from IPCC Assessment Reports"]
[null,null,"20 year time horizon",null,null,null,null,"100 year time horizon",null,null,null,null,"500 year time horizon"]
["Species","Chemical formula","SAR (AR2)","TAR (AR3)","AR4","AR5","AR6","SAR (AR2)","TAR (AR3)","AR4","AR5","AR6","SAR (AR2)","TAR (AR3)","AR4","AR5","AR6"]
["Carbon dioxide","CO2",1,1,1,1,1,1,1,1,1,1,1,1,1,null,1]
["Methane","CH4",56,62,72,84,81.2,21,23,25,28,27.9,6.5,7,7.6,null,7.95]
["Methane, fossil origin","CH4",null,null,null,85,82.5,null,null,null,30,29.8,null,null,null,null,10]
["Methane, non-fossil origin","CH4",null,null,null,null,80.8,null,null,null,null,27.2,null,null,null,null,7.3]
["Nitrous oxide","N2O",280,275,289,264,273,310,296,298,265,273,170,156,153,null,130]
[]
["IPCC Assessment Report","Year ","Link"]
["AR6",2021,"https://www.ipcc.ch/report/ar6/wg1/downloads/report/IPCC_AR6_WGI_Full_Report.pdf"]
["AR5",2013,"https://www.ipcc.ch/site/assets/uploads/2018/02/WG1AR5_all_final.pdf"]
["AR4",2007,"https://www.ipcc.ch/site/assets/uploads/2018/05/ar4_wg1_full_report-1.pdf"]
["TAR (AR3)",2001,"https://www.ipcc.ch/site/assets/uploads/2018/03/WGI_TAR_full_report.pdf"]
["SAR (AR2)",1996,"https://www.ipcc.ch/site/assets/uploads/2018/02/ipcc_sar_wg_I_full_report.pdf"]
{"$rows_left_out":1}
{"sheet":"Revisions","index":15,"n_rows":5,"n_cols":4,"rows_kept":5,"cut":false,"hidden":false,"merged":[]}
["Version","Changes","Implementor","Date"]
[1.1000000000000001,"Updated 100 year global warming potentials to IPCC AR6 and modified spreadsheet to enable easily changed GWPs.","BJM","2022-02-10"]
[null,"Corrected error in Method 3 for reported methane generation.","BJM","2022-02-10"]
[null,"Changed Method 3 on waste management tab to conform to IPCC methodology","BJM","2022-03-01"]
[null,"Created Revision tab","BJM","2022-03-01"]